Site Navigation:
  Update Comments
1 2 3 4 5
Update Comment
Karma
Author Timestamp
qpid-cpp-0.32-2.fc22 Taskotron: upgradepath test PASSED on noarch. Resu 0 taskotron 2015-04-18 23:20:40
dnf-plugins-extras-0.0.5-4.fc22 Taskotron: upgradepath test FAILED on noarch. Resu 0 taskotron 2015-04-18 23:08:30
IBSimu-1.0.5-10.b.fc22 Taskotron: upgradepath test PASSED on noarch. Resu 0 taskotron 2015-04-18 23:06:23
python-mailer-0.8.0-1.fc21 Taskotron: depcheck test PASSED on x86_64. Result 0 taskotron 2015-04-18 21:51:03
python-mailer-0.8.0-1.fc21 Taskotron: depcheck test PASSED on i386. Result lo 0 taskotron 2015-04-18 21:50:32
kernel-3.19.4-200.fc21 Bug 1203913 is resolved. Thank you. 1 amessina 2015-04-18 21:33:45
ltrace-0.7.91-16.fc22 Taskotron: upgradepath test PASSED on noarch. Resu 0 taskotron 2015-04-18 21:31:03
firefox-37.0.1-1.fc20 Taskotron: upgradepath test PASSED on noarch. Resu 0 taskotron 2015-04-18 21:19:30
firefox-37.0.1-1.fc20 I gave karma for you 1 sergiomb 2015-04-18 21:11:03
virt-manager-1.1.0-7.git310f6527.fc21 Taskotron: depcheck test PASSED on x86_64. Result 0 taskotron 2015-04-18 21:02:23
gfs2-utils-3.1.8-2.fc21 Taskotron: depcheck test PASSED on x86_64. Result 0 taskotron 2015-04-18 21:01:44
virt-manager-1.1.0-7.git310f6527.fc21 Taskotron: depcheck test PASSED on i386. Result lo 0 taskotron 2015-04-18 21:01:00
gfs2-utils-3.1.8-2.fc21 Taskotron: depcheck test PASSED on i386. Result lo 0 taskotron 2015-04-18 21:00:34
osgearth-2.6-4.fc22 Taskotron: depcheck test PASSED on x86_64. Result 0 taskotron 2015-04-18 20:58:49
gfs2-utils-3.1.8-2.fc22 Taskotron: depcheck test PASSED on x86_64. Result 0 taskotron 2015-04-18 20:57:41
gmsh-2.9.3-1.fc22 Taskotron: depcheck test PASSED on x86_64. Result 0 taskotron 2015-04-18 20:57:35
osgearth-2.6-4.fc22 Taskotron: depcheck test PASSED on i386. Result lo 0 taskotron 2015-04-18 20:56:06
gfs2-utils-3.1.8-2.fc22 Taskotron: depcheck test PASSED on i386. Result lo 0 taskotron 2015-04-18 20:55:08
gmsh-2.9.3-1.fc22 Taskotron: depcheck test PASSED on i386. Result lo 0 taskotron 2015-04-18 20:54:46
virt-manager-1.1.0-6.git310f6527.fc21 This update has been unpushed 0 crobinso 2015-04-18 20:40:07
virt-manager-1.1.0-6.git310f6527.fc21 Thanks for testing. I'll fix the regression with a 0 crobinso 2015-04-18 20:39:45
golang-github-docker-libcontainer-1.4.0-1.gitd7dea0e.fc22 Taskotron: upgradepath test FAILED on noarch. Resu 0 taskotron 2015-04-18 20:26:18
python-pbr-0.10.8-1.fc22 Taskotron: depcheck test PASSED on x86_64. Result 0 taskotron 2015-04-18 20:26:12
golang-github-coreos-go-systemd-2-4.fc22 Taskotron: upgradepath test FAILED on noarch. Resu 0 taskotron 2015-04-18 20:26:07
python-pbr-0.10.8-1.fc22 Taskotron: depcheck test PASSED on i386. Result lo 0 taskotron 2015-04-18 20:25:05