Site Navigation:
  Update Comments
1 2 3 4 5
Update Comment
Karma
Author Timestamp
kde-settings-22-3.fc22.1, plasma-workspace-5.2.2-6.fc22 1 juliuxpigface 2015-04-19 09:07:02
qesteidutil-3.10.1-3.fc22 Taskotron: depcheck test PASSED on x86_64. Result 0 taskotron 2015-04-19 08:52:57
qdigidoc-3.10.0-3.fc22 Taskotron: depcheck test PASSED on x86_64. Result 0 taskotron 2015-04-19 08:52:22
qesteidutil-3.10.1-3.fc22 Taskotron: depcheck test PASSED on i386. Result lo 0 taskotron 2015-04-19 08:52:05
qdigidoc-3.10.0-3.fc22 Taskotron: depcheck test PASSED on i386. Result lo 0 taskotron 2015-04-19 08:51:31
python-2.7.9-6.fc22 Fixes the bug as expected 1 juliuxpigface 2015-04-19 08:49:10
libdigidocpp-3.10.0-2.fc22 Taskotron: depcheck test PASSED on x86_64. Result 0 taskotron 2015-04-19 08:07:27
libdigidocpp-3.10.0-2.fc22 Taskotron: depcheck test PASSED on i386. Result lo 0 taskotron 2015-04-19 08:06:33
libdigidoc-3.10.0-3.fc22 Taskotron: depcheck test PASSED on x86_64. Result 0 taskotron 2015-04-19 07:22:23
libdigidoc-3.10.0-3.fc22 Taskotron: depcheck test PASSED on i386. Result lo 0 taskotron 2015-04-19 07:21:38
bro-2.3.2-1.fc22 Taskotron: depcheck test FAILED on x86_64. Result 0 taskotron 2015-04-19 06:36:55
bro-2.3.2-1.fc21 Taskotron: depcheck test FAILED on x86_64. Result 0 taskotron 2015-04-19 06:36:14
bro-2.3.2-1.fc22 Taskotron: depcheck test FAILED on i386. Result lo 0 taskotron 2015-04-19 06:36:09
selinux-policy-3.13.1-105.13.fc21 1 greg18 2015-04-19 06:36:07
bro-2.3.2-1.fc21 Taskotron: depcheck test FAILED on i386. Result lo 0 taskotron 2015-04-19 06:35:43
arm-none-eabi-gcc-cs-4.9.2-3.fc21, arm-none-eabi-newlib-2.2.0_1-1.fc21 I can verify that I am able to successfully link A 1 dimitrijer 2015-04-19 06:31:10
kernel-3.19.4-200.fc21 1 greg18 2015-04-19 06:05:51
wine-1.7.41-1.fc22 Taskotron: depcheck test PASSED on x86_64. Result 0 taskotron 2015-04-19 05:07:32
wine-1.7.41-1.fc22 Taskotron: depcheck test PASSED on i386. Result lo 0 taskotron 2015-04-19 05:06:40
wine-1.7.41-1.fc21 Taskotron: depcheck test PASSED on x86_64. Result 0 taskotron 2015-04-19 05:06:37
wine-1.7.41-1.fc21 Taskotron: depcheck test PASSED on i386. Result lo 0 taskotron 2015-04-19 05:05:59
wine-1.7.41-1.fc20 Taskotron: depcheck test PASSED on x86_64. Result 0 taskotron 2015-04-19 05:05:42
wine-1.7.41-1.fc20 Taskotron: depcheck test PASSED on i386. Result lo 0 taskotron 2015-04-19 05:05:14
pngquant-2.4.0.1-3.fc21 Taskotron: depcheck test PASSED on x86_64. Result 0 taskotron 2015-04-19 03:35:37
python-mailer-0.8.0-1.fc20 Taskotron: depcheck test PASSED on x86_64. Result 0 taskotron 2015-04-19 03:35:26